BDBM50033889 CHEMBL3358609
SMILES CN(CC(=O)N(Cc1ccc(cc1)C(C)(C)C)c1ccc(C(O)=O)c(O)c1)S(=O)(=O)c1c(F)c(F)c(F)c(F)c1F
InChI Key InChIKey=JABKRSQEWFBIFT-UHFFFAOYSA-N
Data  1 KI
  Tab Delimited (TSV)   2D SDfile   Computed 3D by Vconf -m prep SDfile
Find this compound or compounds like it in BindingDB:
Activity Spreadsheet -- Enzyme Inhibition Constant Data from BindingDB
Found 1 hit for monomerid = 50033889
TargetSignal transducer and activator of transcription 5B(Homo sapiens (Human))
University Of Toronto Mississauga
Curated by ChEMBL
LigandPNGBDBM50033889(CHEMBL3358609)
Affinity DataKi: >6.00E+4nM. Assay description: Inhibition of STAT5B SH2 domain (unknown origin)-5-FAM-GpYLVLDKW interaction compound treated for 15 mins by fluorescent polarization assay
In DepthDetails ArticlePubMed