BDBM50033894 5-Amino-2-(2-dimethylamino-ethyl)-benzo[de]isoquinoline-1,3-dione (amonafide)::5-Amino-2-(2-dimethylamino-ethyl)-benzo[de]isoquinoline-1,3-dione(Amonafide)::5-amino-2-(2-dimethylamino-ethyl)-benzo[de]isoquinoline-1,3-dione::5-amino-2-[2-(dimethylamino)ethyl]-1H-benzo[de]isoquinoline-1,3(2H)-dione::Amonofide::CHEMBL428676::NCI-308847
SMILES CN(C)CCN1C(=O)c2cccc3cc(N)cc(C1=O)c23
InChI Key InChIKey=UPALIKSFLSVKIS-UHFFFAOYSA-N
Data  1 IC50
  Tab Delimited (TSV)   2D SDfile   Computed 3D by Vconf -m prep SDfile
Find this compound or compounds like it in BindingDB:
Activity Spreadsheet -- Enzyme Inhibition Constant Data from BindingDB
Found 1 hit for monomerid = 50033894
TargetCytochrome P450 2D6(Homo sapiens (Human))
University Of Leicester
Curated by ChEMBL
LigandPNGBDBM50033894(5-Amino-2-(2-dimethylamino-ethyl)-benzo[de]isoquin...)
Affinity DataIC50:  3.96E+4nM. Assay description: Inhibitory concentration against cytochrome P450 2D6
In DepthDetails ArticlePubMed