BDBM50033948 1-[5-(4,5-Diphenyl-1H-imidazol-2-ylsulfanyl)-pentyl]-1-[2-(2-hydroxy-ethoxy)-ethyl]-3-isopropyl-urea::CHEMBL11631
SMILES CC(C)NC(=O)N(CCCCCSc1nc(c([nH]1)-c1ccccc1)-c1ccccc1)CCOCCO
InChI Key InChIKey=UWNBSTBYGSPEMJ-UHFFFAOYSA-N
Data  1 IC50
  Tab Delimited (TSV)   2D SDfile   Computed 3D by Vconf -m prep SDfile
Find this compound or compounds like it in BindingDB:
Activity Spreadsheet -- Enzyme Inhibition Constant Data from BindingDB
Found 1 hit for monomerid = 50033948
TargetSterol O-acyltransferase 1(Rattus norvegicus)
Dupont Pharmaceuticals
Curated by ChEMBL
LigandPNGBDBM50033948(1-[5-(4,5-Diphenyl-1H-imidazol-2-ylsulfanyl)-penty...)
Affinity DataIC50:  90nM. Assay description: Concentration required to inhibit 50% activity of Acyl coenzyme A:cholesterol acyltransferase 1 in vitro using rat liver microsome.
In DepthDetails ArticlePubMed