BDBM50033973 1-{5-[4,5-Bis-(4-trifluoromethyl-phenyl)-1H-imidazol-2-ylsulfanyl]-pentyl}-3-(2,4-difluoro-phenyl)-1-heptyl-urea::CHEMBL269463
SMILES CCCCCCCN(CCCCCSc1nc(c([nH]1)-c1ccc(cc1)C(F)(F)F)-c1ccc(cc1)C(F)(F)F)C(=O)Nc1ccc(F)cc1F
InChI Key InChIKey=RKEOGPZBMFDACN-UHFFFAOYSA-N
Data  1 IC50
  Tab Delimited (TSV)   2D SDfile   Computed 3D by Vconf -m prep SDfile
Find this compound or compounds like it in BindingDB:
Activity Spreadsheet -- Enzyme Inhibition Constant Data from BindingDB
Found 1 hit for monomerid = 50033973
TargetSterol O-acyltransferase 1(Rattus norvegicus)
Dupont Pharmaceuticals
Curated by ChEMBL
LigandPNGBDBM50033973(1-{5-[4,5-Bis-(4-trifluoromethyl-phenyl)-1H-imidaz...)
Affinity DataIC50:  3.99E+4nM. Assay description: Concentration required to inhibit 50% activity of Acyl coenzyme A:cholesterol acyltransferase 1 in vitro using rat liver microsome.
In DepthDetails ArticlePubMed