BDBM50033990 3-(2,4-Difluoro-phenyl)-1-{2-[2-(4,5-diphenyl-1H-imidazol-2-ylsulfanyl)-ethoxy]-ethyl}-1-heptyl-urea::CHEMBL11422
SMILES CCCCCCCN(CCOCCSc1nc(c([nH]1)-c1ccccc1)-c1ccccc1)C(=O)Nc1ccc(F)cc1F
InChI Key InChIKey=WRQCBEIMRWBEKN-UHFFFAOYSA-N
Data  1 IC50
  Tab Delimited (TSV)   2D SDfile   Computed 3D by Vconf -m prep SDfile
Find this compound or compounds like it in BindingDB:
Activity Spreadsheet -- Enzyme Inhibition Constant Data from BindingDB
Found 1 hit for monomerid = 50033990
TargetSterol O-acyltransferase 1(Rattus norvegicus)
Dupont Pharmaceuticals
Curated by ChEMBL
LigandPNGBDBM50033990(3-(2,4-Difluoro-phenyl)-1-{2-[2-(4,5-diphenyl-1H-i...)
Affinity DataIC50:  80nM. Assay description: Concentration required to inhibit 50% activity of Acyl coenzyme A:cholesterol acyltransferase 1 in vitro using rat liver microsome.
In DepthDetails ArticlePubMed