BDBM50033997 1-{5-[4,5-Bis-(4-fluoro-phenyl)-1H-imidazol-2-ylsulfanyl]-pentyl}-3-(2,4-difluoro-phenyl)-1-heptyl-urea::CHEMBL11445
SMILES CCCCCCCN(CCCCCSc1nc(c([nH]1)-c1ccc(F)cc1)-c1ccc(F)cc1)C(=O)Nc1ccc(F)cc1F
InChI Key InChIKey=SJNCAPNQNCLBMB-UHFFFAOYSA-N
Data  1 IC50
  Tab Delimited (TSV)   2D SDfile   Computed 3D by Vconf -m prep SDfile
Find this compound or compounds like it in BindingDB:
Activity Spreadsheet -- Enzyme Inhibition Constant Data from BindingDB
Found 1 hit for monomerid = 50033997
TargetSterol O-acyltransferase 1(Rattus norvegicus)
Dupont Pharmaceuticals
Curated by ChEMBL
LigandPNGBDBM50033997(1-{5-[4,5-Bis-(4-fluoro-phenyl)-1H-imidazol-2-ylsu...)
Affinity DataIC50:  40nM. Assay description: Concentration required to inhibit 50% activity of Acyl coenzyme A:cholesterol acyltransferase 1 in vitro using rat liver microsome.
In DepthDetails ArticlePubMed