BDBM50034117 CHEMBL406275::Tyr-Ile-Asn-Leu-Ile-Thr-Arg-Leu-Tyr-NH2
SMILES CC[C@H](C)[C@H](NC(=O)[C@@H](N)Cc1ccc(O)cc1)C(=O)N[C@@H](CC(N)=O)C(=O)N[C@@H](CC(C)C)C(=O)N[C@@H]([C@@H](C)CC)C(=O)N[C@@H]([C@@H](C)O)C(=O)N[C@@H](CCCNC(N)=N)C(=O)N[C@@H](CC(C)C)C(=O)N[C@@H](Cc1ccc(O)cc1)C(N)=O
InChI Key InChIKey=NJERIKSPICTITL-DCLOKTFBSA-N
Data  1 IC50
  Tab Delimited (TSV)   2D SDfile   Computed 3D by Vconf -m prep SDfile
Find this compound or compounds like it in BindingDB:
Activity Spreadsheet -- Enzyme Inhibition Constant Data from BindingDB
Found 1 hit for monomerid = 50034117
TargetNeuropeptide Y receptor type 2(RAT)
Burroughs Wellcome
Curated by ChEMBL
LigandPNGBDBM50034117(CHEMBL406275 | Tyr-Ile-Asn-Leu-Ile-Thr-Arg-Leu-Tyr...)
Affinity DataIC50:  2.10E+3nM. Assay description: 50% displacement of specifically bound [3H]-NPY2 from rat brain membranes.
In DepthDetails ArticlePubMed