BDBM50034198 4-Benzhydrylidene-1-phenethyl-piperidine::CHEMBL18592
SMILES [#6](-[#6]-c1ccccc1)-[#7]-1-[#6]-[#6]\[#6](-[#6]-[#6]-1)=[#6](\c1ccccc1)-c1ccccc1
InChI Key InChIKey=LGXNYFAERISAHX-UHFFFAOYSA-N
Data  2 KI
  Tab Delimited (TSV)   2D SDfile   Computed 3D by Vconf -m prep SDfile
Find this compound or compounds like it in BindingDB:
Activity Spreadsheet -- Enzyme Inhibition Constant Data from BindingDB
Found 2 hits for monomerid = 50034198
Target5-hydroxytryptamine receptor 2A(Rattus norvegicus (rat))
Virginia Commonwealth University
Curated by ChEMBL
LigandPNGBDBM50034198(4-Benzhydrylidene-1-phenethyl-piperidine | CHEMBL1...)
Affinity DataKi:  6.90nM. Assay description: Binding affinity against 5-hydroxytryptamine 2A receptor
In DepthDetails ArticlePubMed
Target5-hydroxytryptamine receptor 2C(Rattus norvegicus (Rat))
Virginia Commonwealth University
Curated by ChEMBL
LigandPNGBDBM50034198(4-Benzhydrylidene-1-phenethyl-piperidine | CHEMBL1...)
Affinity DataKi:  29nM. Assay description: Binding affinity against 5-hydroxytryptamine 2C receptor
In DepthDetails ArticlePubMed