BDBM50034357 (2aR,8bR)-2-Allyl-8-methoxy-1,2,2a,3,4,8b-hexahydro-naphtho[2,1-b]azete::(Recemic)2-Allyl-8-methoxy-1,2,2a,3,4,8b-hexahydro-naphtho[2,1-b]azete::CHEMBL24161
SMILES COc1cccc2CC[C@@H]3[C@@H](CN3CC=C)c12
InChI Key InChIKey=FLYJXYQYBLPWIJ-CHWSQXEVSA-N
Data  2 KI
  Tab Delimited (TSV)   2D SDfile   Computed 3D by Vconf -m prep SDfile
Find this compound or compounds like it in BindingDB:
Activity Spreadsheet -- Enzyme Inhibition Constant Data from BindingDB
Found 2 hits for monomerid = 50034357
Target5-hydroxytryptamine receptor 1A(Homo sapiens (Human))
Upjohn Laboratories
Curated by ChEMBL
LigandPNGBDBM50034357((2aR,8bR)-2-Allyl-8-methoxy-1,2,2a,3,4,8b-hexahydr...)
Affinity DataKi:  5.90nM. Assay description: Binding affinity against 5-hydroxytryptamine 1A receptor from bovine hippocampus, used [3H]8-OH-DPAT as radioligand
In DepthDetails ArticlePubMed
Target5-hydroxytryptamine receptor 1A(Homo sapiens (Human))
Upjohn Laboratories
Curated by ChEMBL
LigandPNGBDBM50034357((2aR,8bR)-2-Allyl-8-methoxy-1,2,2a,3,4,8b-hexahydr...)
Affinity DataKi:  5.90nM. Assay description: Tested for activity against 5-hydroxytryptamine 1A receptor from bovine hippocampus
In DepthDetails ArticlePubMed