BDBM50034540 2-substituted NECA derivatives, 10::5-(6-Amino-2-furan-2-ylethynyl-purin-9-yl)-3,4-dihydroxy-tetrahydro-furan-2-carboxylic acid ethylamide::5-{6-amino-2-[2-(furan-2-yl)ethynyl]-9H-purin-9-yl}-N-ethyl-3,4-dihydroxyoxolane-2-carboxamide
SMILES CCNC(=O)C1OC(C(O)C1O)n1cnc2c(N)nc(nc12)C#Cc1ccco1
InChI Key InChIKey=YGJTXZLLALEEMC-UHFFFAOYSA-N
Data  3 KI
  Tab Delimited (TSV)   2D SDfile   Computed 3D by Vconf -m prep SDfile
Find this compound or compounds like it in BindingDB:
Activity Spreadsheet -- Enzyme Inhibition Constant Data from BindingDB
Found 3 hits for monomerid = 50034540
TargetAdenosine receptor A3(Homo sapiens (Human))
Universitat Wurzburg
Curated by PDSP Ki Database
LigandPNGBDBM50034540(2-substituted NECA derivatives, 10 | 5-(6-Amino-2-...)
Affinity DataKi:  12nM
In DepthDetails ArticlePubMed
TargetAdenosine receptor A1(Homo sapiens (Human))
Universitat Wurzburg
Curated by PDSP Ki Database
LigandPNGBDBM50034540(2-substituted NECA derivatives, 10 | 5-(6-Amino-2-...)
Affinity DataKi:  140nM
In DepthDetails ArticlePubMed
TargetAdenosine receptor A2a(Homo sapiens (Human))
Universitat Wurzburg
Curated by PDSP Ki Database
LigandPNGBDBM50034540(2-substituted NECA derivatives, 10 | 5-(6-Amino-2-...)
Affinity DataKi:  510nM
In DepthDetails ArticlePubMed