BDBM50034587 CHEMBL288407::Peptide boronate
SMILES Cc1ccc(CCC(NC(=O)[C@@H]2CCCN2C(=O)[C@H](Cc2ccccc2)NC(=O)OCc2ccccc2)B2O[C@@H]3CC4CC(C4(C)C)[C@]3(C)O2)cc1
InChI Key InChIKey=PNFXOASCTGSHPH-IQZMOTSVSA-N
Data  1 KI
  Tab Delimited (TSV)   2D SDfile   Computed 3D by Vconf -m prep SDfile
Find this compound or compounds like it in BindingDB:
Activity Spreadsheet -- Enzyme Inhibition Constant Data from BindingDB
Found 1 hit for monomerid = 50034587
TargetProthrombin(Homo sapiens (Human))
Thrombosis Research Institute
Curated by ChEMBL
LigandPNGBDBM50034587(CHEMBL288407 | Peptide boronate)
Affinity DataKi:  20nM. Assay description: Binding affinity against thrombin
In DepthDetails ArticlePubMed