BDBM50034881 CHEMBL3338102
SMILES Cc1c(Cc2ccccc2S(=O)(=O)c2cccc(F)c2)c2c(CCNC2=O)n1CC(O)=O
InChI Key InChIKey=XXFNFZUDTORRKP-UHFFFAOYSA-N
Data  1 IC50
  Tab Delimited (TSV)   2D SDfile   Computed 3D by Vconf -m prep SDfile
Find this compound or compounds like it in BindingDB:
Activity Spreadsheet -- Enzyme Inhibition Constant Data from BindingDB
Found 1 hit for monomerid = 50034881
TargetProstaglandin D2 receptor 2(Homo sapiens (Human))
RhôNe-Poulenc Rorer
Curated by ChEMBL
LigandPNGBDBM50034881(CHEMBL3338102)
Affinity DataIC50:  6.20nM. Assay description: Antagonist activity at CRTh2 (unknown origin) stably expressed in PGD2-stimulated CHO.K1 cells preincubated for 1 hr by radio-labelled [35S]-GTPgamma...
In DepthDetails ArticlePubMed