BDBM50035070 CHEMBL3338278
SMILES Cc1ccc2c(CC(O)=O)cn(-c3ccc(Cl)cc3Cc3cncnc3)c2n1
InChI Key InChIKey=AIWCYXGPEABPFB-UHFFFAOYSA-N
Data  1 IC50
  Tab Delimited (TSV)   2D SDfile   Computed 3D by Vconf -m prep SDfile
Find this compound or compounds like it in BindingDB:
Activity Spreadsheet -- Enzyme Inhibition Constant Data from BindingDB
Found 1 hit for monomerid = 50035070
TargetProstaglandin D2 receptor 2(Homo sapiens (Human))
RhôNe-Poulenc Rorer
Curated by ChEMBL
LigandPNGBDBM50035070(CHEMBL3338278)
Affinity DataIC50:  1.40E+3nM. Assay description: Antagonist activity at CRTh2 (unknown origin) stably expressed in PGD2-stimulated CHO.K1 cells preincubated for 1 hr by radio-labelled [35S]-GTPgamma...
In DepthDetails ArticlePubMed