BDBM50035234 CHEMBL3343341
SMILES COc1n(nc2ccccc12)-c1ccc(I)cc1
InChI Key InChIKey=WVWBQOTUXBDFGU-UHFFFAOYSA-N
Data  1 IC50
  Tab Delimited (TSV)   2D SDfile   Computed 3D by Vconf -m prep SDfile
Find this compound or compounds like it in BindingDB:
Activity Spreadsheet -- Enzyme Inhibition Constant Data from BindingDB
Found 1 hit for monomerid = 50035234
TargetMyeloperoxidase(Homo sapiens (Human))
University Of California
Curated by ChEMBL
LigandPNGBDBM50035234(CHEMBL3343341)
Affinity DataIC50:  2.00E+3nM. Assay description: Inhibition of myeloperoxidase (unknown origin) assessed as reduction in enzymatic hypochlorous acid production by spectrophotometry based taurine chl...
In DepthDetails ArticlePubMed