BDBM50035310 (1-Methyl-6,7,8,9-tetrahydro-3H-benzo[e]indol-8-yl)-dipropyl-amine::CHEMBL69562
SMILES CCCN(CCC)C1CCc2ccc3[nH]cc(C)c3c2C1
InChI Key InChIKey=BLMNALZUWKHXKM-UHFFFAOYSA-N
Data  5 KI
  Tab Delimited (TSV)   2D SDfile   Computed 3D by Vconf -m prep SDfile
Find this compound or compounds like it in BindingDB:
Activity Spreadsheet -- Enzyme Inhibition Constant Data from BindingDB
Found 5 hits for monomerid = 50035310
Target5-hydroxytryptamine receptor 1A(Rattus norvegicus (rat))
GöTeborg University
Curated by ChEMBL
LigandPNGBDBM50035310((1-Methyl-6,7,8,9-tetrahydro-3H-benzo[e]indol-8-yl...)
Affinity DataKi:  13nM. Assay description: Binding affinity against 5-hydroxytryptamine 1A receptor from CHO-K1 cells, using [3H]-8-OH-DPAT as the radioligand.
In DepthDetails ArticlePubMed
TargetD(2) dopamine receptor(Rattus norvegicus (rat))
GöTeborg University
Curated by ChEMBL
LigandPNGBDBM50035310((1-Methyl-6,7,8,9-tetrahydro-3H-benzo[e]indol-8-yl...)
Affinity DataKi:  14nM. Assay description: Binding affinity against Dopamine receptor D2 expressed in CHO-K1 cells, using [3H]-U-86,170 as the radioligand.
In DepthDetails ArticlePubMed
Target5-hydroxytryptamine receptor 1D(Homo sapiens (Human))
GöTeborg University
Curated by ChEMBL
LigandPNGBDBM50035310((1-Methyl-6,7,8,9-tetrahydro-3H-benzo[e]indol-8-yl...)
Affinity DataKi:  43nM. Assay description: Binding affinity against 5-hydroxytryptamine 1D receptor alpha expressed in CHO-K1 cells, using [3H]-5-HT as the radioligand.
In DepthDetails ArticlePubMed
TargetD(3) dopamine receptor(Rattus norvegicus (Rat))
GöTeborg University
Curated by ChEMBL
LigandPNGBDBM50035310((1-Methyl-6,7,8,9-tetrahydro-3H-benzo[e]indol-8-yl...)
Affinity DataKi:  67nM. Assay description: Binding affinity against Dopamine receptor D3 expressed in CHO-K1 cells, using [3H]-spiperone as the radioligand.
In DepthDetails ArticlePubMed
Target5-hydroxytryptamine receptor 1B(Homo sapiens (Human))
GöTeborg University
Curated by ChEMBL
LigandPNGBDBM50035310((1-Methyl-6,7,8,9-tetrahydro-3H-benzo[e]indol-8-yl...)
Affinity DataKi:  789nM. Assay description: Binding affinity against 5-hydroxytryptamine 1D receptor beta expressed in CHO-K1 cells, using [3H]-5-HT as the radioligand.
In DepthDetails ArticlePubMed