BDBM50035332 2-Fluoro-N*6*,N*6*-dipropyl-5,6,7,8-tetrahydro-naphthalene-1,6-diamine::CHEMBL71676
SMILES CCCN(CCC)C1CCc2c(C1)ccc(F)c2N
InChI Key InChIKey=GBMSGSHLNWAQNZ-UHFFFAOYSA-N
Data  5 KI
  Tab Delimited (TSV)   2D SDfile   Computed 3D by Vconf -m prep SDfile
Find this compound or compounds like it in BindingDB:
Activity Spreadsheet -- Enzyme Inhibition Constant Data from BindingDB
Found 5 hits for monomerid = 50035332
TargetD(3) dopamine receptor(Rattus norvegicus (Rat))
GöTeborg University
Curated by ChEMBL
LigandPNGBDBM50035332(2-Fluoro-N*6*,N*6*-dipropyl-5,6,7,8-tetrahydro-nap...)
Affinity DataKi:  77nM. Assay description: Binding affinity against Dopamine receptor D3 from CHO-K1 cells, using [3H]-spiperone as the radioligand.
In DepthDetails ArticlePubMed
TargetD(2) dopamine receptor(Rattus norvegicus (rat))
GöTeborg University
Curated by ChEMBL
LigandPNGBDBM50035332(2-Fluoro-N*6*,N*6*-dipropyl-5,6,7,8-tetrahydro-nap...)
Affinity DataKi:  86nM. Assay description: Binding affinity against Dopamine receptor D2 from CHO-K1 cells, using [3H]-U-86,170 as the radioligand.
In DepthDetails ArticlePubMed
Target5-hydroxytryptamine receptor 1A(Rattus norvegicus (rat))
GöTeborg University
Curated by ChEMBL
LigandPNGBDBM50035332(2-Fluoro-N*6*,N*6*-dipropyl-5,6,7,8-tetrahydro-nap...)
Affinity DataKi:  123nM. Assay description: Binding affinity against 5-hydroxytryptamine 1A receptor from CHO-K1 cells, using [3H]-8-OH-DPAT as the radioligand.
In DepthDetails ArticlePubMed
Target5-hydroxytryptamine receptor 1D(Homo sapiens (Human))
GöTeborg University
Curated by ChEMBL
LigandPNGBDBM50035332(2-Fluoro-N*6*,N*6*-dipropyl-5,6,7,8-tetrahydro-nap...)
Affinity DataKi:  762nM. Assay description: Binding affinity against 5-hydroxytryptamine 1D receptor alpha expressed in CHO-K1 cells, using [3H]-5-HT as the radioligand.
In DepthDetails ArticlePubMed
Target5-hydroxytryptamine receptor 1B(Homo sapiens (Human))
GöTeborg University
Curated by ChEMBL
LigandPNGBDBM50035332(2-Fluoro-N*6*,N*6*-dipropyl-5,6,7,8-tetrahydro-nap...)
Affinity DataKi:  2.02E+3nM. Assay description: Binding affinity against 5-hydroxytryptamine 1D receptor beta expressed in CHO-K1 cells, using [3H]-5-HT as the radioligand.
In DepthDetails ArticlePubMed