BDBM50035565 5-(3,4-Dichloro-phenyl)-2,3-dihydro-imidazo[2,1-a]isoquinoline::CHEMBL310866
SMILES Clc1ccc(cc1Cl)C1=Cc2ccccc2C2=NCCN12
InChI Key InChIKey=AHXZDQDPYIIPTD-UHFFFAOYSA-N
Data  1 IC50
  Tab Delimited (TSV)   2D SDfile   Computed 3D by Vconf -m prep SDfile
Find this compound or compounds like it in BindingDB:
Activity Spreadsheet -- Enzyme Inhibition Constant Data from BindingDB
Found 1 hit for monomerid = 50035565
TargetPlatelet-activating factor receptor(Homo sapiens (Human))
Sandoz Research Institute
Curated by ChEMBL
LigandPNGBDBM50035565(5-(3,4-Dichloro-phenyl)-2,3-dihydro-imidazo[2,1-a]...)
Affinity DataIC50:  1.70E+4nM. Assay description: Inhibition of [3H]-PAF binding to human platelet activating factor receptor
In DepthDetails ArticlePubMed