BDBM50035599 CHEMBL3356635
SMILES O=C(Nc1ccc2CCNc2c1)c1c[nH]c2ccccc2c1=O
InChI Key InChIKey=KVFDYIPHNQIYKT-UHFFFAOYSA-N
Data  1 EC50
  Tab Delimited (TSV)   2D SDfile   Computed 3D by Vconf -m prep SDfile
Find this compound or compounds like it in BindingDB:
Activity Spreadsheet -- Enzyme Inhibition Constant Data from BindingDB
Found 1 hit for monomerid = 50035599
TargetCystic fibrosis transmembrane conductance regulator(Homo sapiens (Human))
Vertex Pharmaceuticals
Curated by ChEMBL
LigandPNGBDBM50035599(CHEMBL3356635)
Affinity DataEC50:  400nM. Assay description: Potentiation of human CFTR F508del mutant expressed in mouse NIH-3T3 cells after 30 mins by fluorescent voltage sensing optical assay
In DepthDetails ArticlePubMed