BDBM50035624 CHEMBL106657::[(1S,2S,4R)-1-Benzyl-4-(cyclohexylmethyl-carbamoyl)-2-hydroxy-5-phenyl-pentyl]-carbamic acid tert-butyl ester::[1-Benzyl-4-(cyclohexylmethyl-carbamoyl)-2-hydroxy-5-phenyl-pentyl]-carbamic acid tert-butyl ester
SMILES CC(C)(C)OC(=O)N[C@@H](Cc1ccccc1)[C@@H](O)C[C@@H](Cc1ccccc1)C(=O)NCC1CCCCC1
InChI Key InChIKey=JBHUHGCQDKMGTJ-PKTNWEFCSA-N
Data  3 IC50
  Tab Delimited (TSV)   2D SDfile   Computed 3D by Vconf -m prep SDfile
Find this compound or compounds like it in BindingDB:
Activity Spreadsheet -- Enzyme Inhibition Constant Data from BindingDB
Found 3 hits for monomerid = 50035624
TargetGag-Pol polyprotein [489-587](Human immunodeficiency virus type 1)
Merck Research Laboratories
Curated by ChEMBL
LigandPNGBDBM50035624(CHEMBL106657 | [(1S,2S,4R)-1-Benzyl-4-(cyclohexylm...)
Affinity DataIC50:  3.00E+4nM. Assay description: In vitro inhibition of HIV-1 proteaseChecked by Author
In DepthDetails ArticlePubMed
TargetGag-Pol polyprotein [489-587](Human immunodeficiency virus type 1)
Merck Research Laboratories
Curated by ChEMBL
LigandPNGBDBM50035624(CHEMBL106657 | [(1S,2S,4R)-1-Benzyl-4-(cyclohexylm...)
Affinity DataIC50:  3.02E+4nM. Assay description: Inhibition of human immunodeficiency virus type 1 (HIV-1) protease enzyme.
In DepthDetails ArticlePubMed
TargetGag-Pol polyprotein [489-587](Human immunodeficiency virus type 1)
Merck Research Laboratories
Curated by ChEMBL
LigandPNGBDBM50035624(CHEMBL106657 | [(1S,2S,4R)-1-Benzyl-4-(cyclohexylm...)
Affinity DataIC50:  3.02E+4nM. Assay description: Inhibitory activity against HIV-1 protease.
In DepthDetails ArticlePubMed