BDBM50035641 CHEMBL110385::[(1S,2S)-1-Benzyl-2-hydroxy-4-((1S,2R)-2-hydroxy-indan-1-ylcarbamoyl)-butyl]-carbamic acid tert-butyl ester
SMILES CC(C)(C)OC(=O)N[C@@H](Cc1ccccc1)[C@@H](O)CCC(=O)N[C@@H]1[C@H](O)Cc2ccccc12
InChI Key InChIKey=HWGROABSIPVQIQ-YCSHWKNNSA-N
Data  2 IC50
  Tab Delimited (TSV)   2D SDfile   Computed 3D by Vconf -m prep SDfile
Find this compound or compounds like it in BindingDB:
Activity Spreadsheet -- Enzyme Inhibition Constant Data from BindingDB
Found 2 hits for monomerid = 50035641
TargetGag-Pol polyprotein [489-587](Human immunodeficiency virus type 1)
Universidad De Alcal£
Curated by ChEMBL
LigandPNGBDBM50035641(CHEMBL110385 | [(1S,2S)-1-Benzyl-2-hydroxy-4-((1S,...)
Affinity DataIC50:  2.95E+3nM. Assay description: Inhibitory activity against HIV-1 protease.
In DepthDetails ArticlePubMed
TargetGag-Pol polyprotein [489-587](Human immunodeficiency virus type 1)
Universidad De Alcal£
Curated by ChEMBL
LigandPNGBDBM50035641(CHEMBL110385 | [(1S,2S)-1-Benzyl-2-hydroxy-4-((1S,...)
Affinity DataIC50:  2.93E+3nM. Assay description: In vitro inhibition of HIV-1 proteaseChecked by Author
In DepthDetails ArticlePubMed