BDBM50035712 CHEMBL3359894
SMILES CN1CCN(CC1)c1ccc(cc1)-c1cnc2[nH]c3cnc(cc3c2c1)C(N)=O
InChI Key InChIKey=JAPRUHQEXJGMCA-UHFFFAOYSA-N
Data  1 IC50
  Tab Delimited (TSV)   2D SDfile   Computed 3D by Vconf -m prep SDfile
Find this compound or compounds like it in BindingDB:
Activity Spreadsheet -- Enzyme Inhibition Constant Data from BindingDB
Found 1 hit for monomerid = 50035712
TargetSerine/threonine-protein kinase Chk1(Homo sapiens (Human))
Genentech
Curated by ChEMBL
LigandPNGBDBM50035712(CHEMBL3359894)
Affinity DataIC50:  2.30nM. Assay description: Inhibition of recombinant ChK1 (unknown origin) using AKT substrate by AlphaScreen assay
In DepthDetails ArticlePubMed