BDBM50035716 CHEMBL3359889
SMILES CN1CCN(CC1)c1ccc(cc1)-c1cncc(n1)-c1ccc(cc1)-c1nnn[nH]1
InChI Key InChIKey=QGMYGIYPKCMKBB-UHFFFAOYSA-N
Data  1 IC50
  Tab Delimited (TSV)   2D SDfile   Computed 3D by Vconf -m prep SDfile
Find this compound or compounds like it in BindingDB:
Activity Spreadsheet -- Enzyme Inhibition Constant Data from BindingDB
Found 1 hit for monomerid = 50035716
TargetSerine/threonine-protein kinase Chk1(Homo sapiens (Human))
Genentech
Curated by ChEMBL
LigandPNGBDBM50035716(CHEMBL3359889)
Affinity DataIC50:  470nM. Assay description: Inhibition of recombinant ChK1 (unknown origin) using AKT substrate by AlphaScreen assay
In DepthDetails ArticlePubMed