BDBM50035859 CHEMBL1597544
SMILES COc1ccc(Nc2nc(N)nc(CSC(=S)N3CCCCC3)n2)cc1
InChI Key InChIKey=DVTLQDKKTSMLFA-UHFFFAOYSA-N
Data  1 IC50
  Tab Delimited (TSV)   2D SDfile   Computed 3D by Vconf -m prep SDfile
Find this compound or compounds like it in BindingDB:
Activity Spreadsheet -- Enzyme Inhibition Constant Data from BindingDB
Found 1 hit for monomerid = 50035859
TargetDNA topoisomerase 2-alpha(Homo sapiens (Human))
National Institute Of Chemistry
Curated by ChEMBL
LigandPNGBDBM50035859(CHEMBL1597544)
Affinity DataIC50: >1.00E+6nM. Assay description: Inhibition of human DNA topoisomerase 2alpha using plasmid pNO1 substrate incubated at 37 degC for 30 mins by fluorimetry
In DepthDetails ArticlePubMed