BDBM50035933 CHEMBL3358659
SMILES N[C@@H]1C[C@@H](O)[C@H](O)[C@@H](O)[C@H]1O
InChI Key InChIKey=QXQNRSUOYNMXDL-PQMKYFCFSA-N
Data  1 IC50
  Tab Delimited (TSV)   2D SDfile   Computed 3D by Vconf -m prep SDfile
Find this compound or compounds like it in BindingDB:
Activity Spreadsheet -- Enzyme Inhibition Constant Data from BindingDB
Found 1 hit for monomerid = 50035933
TargetSucrase-isomaltase, intestinal(Rattus norvegicus (Rat))
Chulalongkorn University
Curated by ChEMBL
LigandPNGBDBM50035933(CHEMBL3358659)
Affinity DataIC50:  6.80E+3nM. Assay description: Inhibition of rat intestinal sucrase using sucrose substrate incubated for 10 mins
In DepthDetails ArticlePubMed