BDBM50035967 5-Trifluoromethyl-1-[4-(3-trifluoromethyl-phenyl)-thiazol-2-yl]-1H-pyrazole-4-carboxylic acid (3-carbamimidoyl-propyl)-amide; hydrochloride::CHEMBL557202
SMILES NC(=N)CCCNC(=O)c1cnn(-c2nc(cs2)-c2cccc(c2)C(F)(F)F)c1C(F)(F)F
InChI Key InChIKey=YIHPBANAYPNMTP-UHFFFAOYSA-N
Data  1 IC50
  Tab Delimited (TSV)   2D SDfile   Computed 3D by Vconf -m prep SDfile
Find this compound or compounds like it in BindingDB:
Activity Spreadsheet -- Enzyme Inhibition Constant Data from BindingDB
Found 1 hit for monomerid = 50035967
TargetIntegrin alpha-IIb/beta-3(Homo sapiens (Human))
R. W. Johnson Pharmaceutical Research Institute
Curated by ChEMBL
LigandPNGBDBM50035967(5-Trifluoromethyl-1-[4-(3-trifluoromethyl-phenyl)-...)
Affinity DataIC50:  2.30E+4nM. Assay description: Inhibition of [125I]fibrinogen binding to human Fibrinogen Receptor.
In DepthDetails ArticlePubMed