BDBM50036012 1-[2-(3-Acetyl-1-methyl-1H-indol-2-yldisulfanyl)-1-methyl-1H-indol-3-yl]-ethanone::CHEMBL351920
SMILES CC(=O)c1c(SSc2c(C(C)=O)c3ccccc3n2C)n(C)c2ccccc12
InChI Key InChIKey=TTWGTAOWALLDCB-UHFFFAOYSA-N
Data  2 IC50
  Tab Delimited (TSV)   2D SDfile   Computed 3D by Vconf -m prep SDfile
Find this compound or compounds like it in BindingDB:
Activity Spreadsheet -- Enzyme Inhibition Constant Data from BindingDB
Found 2 hits for monomerid = 50036012
TargetProto-oncogene tyrosine-protein kinase Src(Homo sapiens (Human))
University Of Auckland
Curated by ChEMBL
LigandPNGBDBM50036012(1-[2-(3-Acetyl-1-methyl-1H-indol-2-yldisulfanyl)-1...)
Affinity DataIC50:  1.15E+4nM. Assay description: Inhibitory concentration of the against pp60v-src tyrosine kinase obtained from v-src baculovirus-infected insect cells
In DepthDetails ArticlePubMed
TargetEpidermal growth factor receptor(Homo sapiens (Human))
University Of Auckland
Curated by ChEMBL
LigandPNGBDBM50036012(1-[2-(3-Acetyl-1-methyl-1H-indol-2-yldisulfanyl)-1...)
Affinity DataIC50:  5.60E+3nM. Assay description: Inhibitory concentration compound against EFGR tyrosine kinase obtained from plasma membrane vesicles from cultured A431 cells
In DepthDetails ArticlePubMed