BDBM50036020 2-(3-carbamoyl-1-methyl-1H-2-indolyldisulfanyl)-1-methyl-1H-3-indolecarboxamide0.5 H2O::CHEMBL157807
SMILES Cn1c(SSc2c(C(N)=O)c3ccccc3n2C)c(C(N)=O)c2ccccc12
InChI Key InChIKey=ONLDCBOXACFNKL-UHFFFAOYSA-N
Data  2 IC50
  Tab Delimited (TSV)   2D SDfile   Computed 3D by Vconf -m prep SDfile
Find this compound or compounds like it in BindingDB:
Activity Spreadsheet -- Enzyme Inhibition Constant Data from BindingDB
Found 2 hits for monomerid = 50036020
TargetProto-oncogene tyrosine-protein kinase Src(Homo sapiens (Human))
University Of Auckland
Curated by ChEMBL
LigandPNGBDBM50036020(2-(3-carbamoyl-1-methyl-1H-2-indolyldisulfanyl)-1-...)
Affinity DataIC50:  800nM. Assay description: Inhibitory concentration of the against pp60v-src tyrosine kinase obtained from v-src baculovirus-infected insect cells
In DepthDetails ArticlePubMed
TargetEpidermal growth factor receptor(Homo sapiens (Human))
University Of Auckland
Curated by ChEMBL
LigandPNGBDBM50036020(2-(3-carbamoyl-1-methyl-1H-2-indolyldisulfanyl)-1-...)
Affinity DataIC50:  4.70E+3nM. Assay description: Inhibitory concentration compound against EFGR tyrosine kinase obtained from plasma membrane vesicles from cultured A431 cells
In DepthDetails ArticlePubMed