BDBM50036043 ((S)-1-{(S)-2-[(S)-1-(Benzofuran-2-carbonyl)-2-methyl-propylcarbamoyl]-pyrrolidine-1-carbonyl}-2-methyl-propyl)-carbamic acid benzyl ester::CHEMBL167824::benzyl (S)-1-((S)-2-(((S)-1-(benzofuran-2-yl)-3-methyl-1-oxobutan-2-yl)carbamoyl)pyrrolidin-1-yl)-3-methyl-1-oxobutan-2-ylcarbamate
SMILES CC(C)[C@H](NC(=O)OCc1ccccc1)C(=O)N1CCC[C@H]1C(=O)N[C@@H](C(C)C)C(=O)c1cc2ccccc2o1
InChI Key InChIKey=SMBPZLWPLFCGIZ-YGPDHOBYSA-N
Data  3 KI
  Tab Delimited (TSV)   2D SDfile   Computed 3D by Vconf -m prep SDfile
Find this compound or compounds like it in BindingDB:
Activity Spreadsheet -- Enzyme Inhibition Constant Data from BindingDB
Found 3 hits for monomerid = 50036043
TargetNeutrophil elastase(Homo sapiens (Human))
Zeneca Pharmaceuticals
Curated by ChEMBL
LigandPNGBDBM50036043(((S)-1-{(S)-2-[(S)-1-(Benzofuran-2-carbonyl)-2-met...)
Affinity DataKi:  3.40E+3nM. Assay description: In vitro inhibitory activity against human neutrophil elastase (HNE) catalyzed hydrolysis of the synthetic substrate MeO-Suc-Ala- Ala-Pro-Val-pN
In DepthDetails ArticlePubMed
TargetNeutrophil elastase(Homo sapiens (Human))
Zeneca Pharmaceuticals
Curated by ChEMBL
LigandPNGBDBM50036043(((S)-1-{(S)-2-[(S)-1-(Benzofuran-2-carbonyl)-2-met...)
Affinity DataKi:  3.40E+3nM. Assay description: Inhibition of human neutrophil elastase
In DepthDetails ArticlePubMed
TargetNeutrophil elastase(Homo sapiens (Human))
Zeneca Pharmaceuticals
Curated by ChEMBL
LigandPNGBDBM50036043(((S)-1-{(S)-2-[(S)-1-(Benzofuran-2-carbonyl)-2-met...)
Affinity DataKi:  3.40E+3nM. Assay description: Inhibition of human neutrophil elastase
In DepthDetails ArticlePubMed