BDBM50036157 CHEMBL3358676
SMILES OC1(Cc2ccccc2)CCN(CCNC(=O)Nc2ccnc3c(Br)csc23)CC1
InChI Key InChIKey=FAIMTXULCHXHME-UHFFFAOYSA-N
Data  1 IC50
  Tab Delimited (TSV)   2D SDfile   Computed 3D by Vconf -m prep SDfile
Find this compound or compounds like it in BindingDB:
Activity Spreadsheet -- Enzyme Inhibition Constant Data from BindingDB
Found 1 hit for monomerid = 50036157
TargetUrotensin-2 receptor(Homo sapiens (Human))
Korea Research Institute Of Chemical Technology
Curated by ChEMBL
LigandPNGBDBM50036157(CHEMBL3358676)
Affinity DataIC50:  3.22E+3nM. Assay description: Displacement of europium-labeled urotensin-II from human urotensin-2 receptor expressed in HEK293 cells by TRF assay
In DepthDetails ArticlePubMed