BDBM50036169 3-Selenophen-2-yl-1-aza-bicyclo[2.2.2]oct-2-ene::CHEMBL144123
SMILES C1CN2CCC1C(=C2)c1ccc[se]1
InChI Key InChIKey=CSFZKHHTENQXJK-UHFFFAOYSA-N
Data  3 KI
  Tab Delimited (TSV)   2D SDfile   Computed 3D by Vconf -m prep SDfile
Find this compound or compounds like it in BindingDB:
Activity Spreadsheet -- Enzyme Inhibition Constant Data from BindingDB
Found 3 hits for monomerid = 50036169
TargetMuscarinic acetylcholine receptor M1(Homo sapiens (Human))
Uppsala University
Curated by ChEMBL
LigandPNGBDBM50036169(3-Selenophen-2-yl-1-aza-bicyclo[2.2.2]oct-2-ene | ...)
Affinity DataKi:  410nM. Assay description: Binding affinity for muscarinic acetylcholine receptor M1 by measuring displacement of [3H]-QNB from guinea pig cerebral cortex
In DepthDetails ArticlePubMed
TargetMuscarinic acetylcholine receptor M2(Homo sapiens (Human))
Uppsala University
Curated by ChEMBL
LigandPNGBDBM50036169(3-Selenophen-2-yl-1-aza-bicyclo[2.2.2]oct-2-ene | ...)
Affinity DataKi:  990nM. Assay description: Binding affinity for muscarinic acetylcholine receptor M2 by measuring displacement of [3H]-QNB from guinea pig heart
In DepthDetails ArticlePubMed
TargetMuscarinic acetylcholine receptor(Cavia porcellus)
Uppsala University
Curated by ChEMBL
LigandPNGBDBM50036169(3-Selenophen-2-yl-1-aza-bicyclo[2.2.2]oct-2-ene | ...)
Affinity DataKi:  1.10E+3nM. Assay description: Binding affinity for muscarinic acetylcholine receptor M3 by measuring displacement of [3H]-QNB from guinea pig parotid gland
In DepthDetails ArticlePubMed