BDBM50036727 3-Dipropylamino-1-phenyl-propan-1-one::CHEMBL126738
SMILES CCCN(CCC)CCC(=O)c1ccccc1
InChI Key InChIKey=ZNXAGEKYXGBCDF-UHFFFAOYSA-N
Data  2 IC50
  Tab Delimited (TSV)   2D SDfile   Computed 3D by Vconf -m prep SDfile
Find this compound or compounds like it in BindingDB:
Activity Spreadsheet -- Enzyme Inhibition Constant Data from BindingDB
Found 2 hits for monomerid = 50036727
TargetD(2) dopamine receptor(BOVINE)
New York University
Curated by ChEMBL
LigandPNGBDBM50036727(3-Dipropylamino-1-phenyl-propan-1-one | CHEMBL1267...)
Affinity DataIC50: >5.00E+3nM. Assay description: Binding affinity against Dopamine receptor D2 in bovine striatal homogenate using 200 pM [3H]- spiperone and 250 nM unlabeled ketanserin
In DepthDetails ArticlePubMed
TargetSigma non-opioid intracellular receptor 1(Homo sapiens (Human))
New York University
Curated by ChEMBL
LigandPNGBDBM50036727(3-Dipropylamino-1-phenyl-propan-1-one | CHEMBL1267...)
Affinity DataIC50:  1.25E+3nM. Assay description: Binding affinity against sigma receptor in bovine cerebellum using 2.0 nM [3H]-haloperidol in the presence of 25 nM unlabeled spiperone
In DepthDetails ArticlePubMed