BDBM50036728 1-(2-Chloro-phenyl)-3-[4-(4-chloro-phenyl)-3,6-dihydro-2H-pyridin-1-yl]-propan-1-one::CHEMBL129695
SMILES Clc1ccc(cc1)C1=CCN(CCC(=O)c2ccccc2Cl)CC1
InChI Key InChIKey=YNLYLDZHMDNHMU-UHFFFAOYSA-N
Data  1 IC50
  Tab Delimited (TSV)   2D SDfile   Computed 3D by Vconf -m prep SDfile
Find this compound or compounds like it in BindingDB:
Activity Spreadsheet -- Enzyme Inhibition Constant Data from BindingDB
Found 1 hit for monomerid = 50036728
TargetSigma non-opioid intracellular receptor 1(Homo sapiens (Human))
New York University
Curated by ChEMBL
LigandPNGBDBM50036728(1-(2-Chloro-phenyl)-3-[4-(4-chloro-phenyl)-3,6-dih...)
Affinity DataIC50:  105nM. Assay description: Binding affinity against sigma receptor in bovine cerebellum using 2.0 nM [3H]-haloperidol in the presence of 25 nM unlabeled spiperone
In DepthDetails ArticlePubMed