BDBM50036903 Benzo[d]isothiazole-3-carboxylic acid [2-(4-benzo[d]isothiazol-3-yl-piperazin-1-yl)-ethyl]-amide::CHEMBL72987
SMILES O=C(NCCN1CCN(CC1)c1nsc2ccccc12)c1nsc2ccccc12
InChI Key InChIKey=RDWHXTXGJUIKOG-UHFFFAOYSA-N
Data  3 IC50
  Tab Delimited (TSV)   2D SDfile   Computed 3D by Vconf -m prep SDfile
Find this compound or compounds like it in BindingDB:
Activity Spreadsheet -- Enzyme Inhibition Constant Data from BindingDB
Found 3 hits for monomerid = 50036903
Target5-hydroxytryptamine receptor 1A(Rattus norvegicus (rat))
Hoechst-Roussel Pharmaceuticals
Curated by ChEMBL
LigandPNGBDBM50036903(Benzo[d]isothiazole-3-carboxylic acid [2-(4-benzo[...)
Affinity DataIC50:  98nM. Assay description: Compound was evaluated in vitro for its affinity towards 5-hydroxytryptamine 1A receptor using [3H]-8-OH-DPAT as radioligand in hippocampus
In DepthDetails ArticlePubMed
TargetD(2) dopamine receptor(Rattus norvegicus (rat))
Hoechst-Roussel Pharmaceuticals
Curated by ChEMBL
LigandPNGBDBM50036903(Benzo[d]isothiazole-3-carboxylic acid [2-(4-benzo[...)
Affinity DataIC50:  169nM. Assay description: In vitro affinity towards D2 receptor using [3H]-spiroperidol as radioligand in striatum
In DepthDetails ArticlePubMed
Target5-hydroxytryptamine receptor 2A(Rattus norvegicus (rat))
Hoechst-Roussel Pharmaceuticals
Curated by ChEMBL
LigandPNGBDBM50036903(Benzo[d]isothiazole-3-carboxylic acid [2-(4-benzo[...)
Affinity DataIC50:  475nM. Assay description: In vitro affinity towards 5-hydroxytryptamine 2A receptor using [3H]-spiroperidol as radioligand in cortex
In DepthDetails ArticlePubMed