BDBM50036961 CHEMBL100575::Sodium; (S)-3-amino-4-mercapto-butane-1-sulfonate
SMILES N[C@H](CS)CCS([O-])(=O)=O
InChI Key InChIKey=GHOHRLXVWJYYKJ-BYPYZUCNSA-M
Data  2 KI
  Tab Delimited (TSV)   2D SDfile   Computed 3D by Vconf -m prep SDfile
Find this compound or compounds like it in BindingDB:
Activity Spreadsheet -- Enzyme Inhibition Constant Data from BindingDB
Found 2 hits for monomerid = 50036961
TargetGlutamyl aminopeptidase(Homo sapiens (Human))
University Of Paris
Curated by ChEMBL
LigandPNGBDBM50036961(CHEMBL100575 | Sodium; (S)-3-amino-4-mercapto-buta...)
Affinity DataKi:  290nM. Assay description: Inihibitionof aminopeptidase A (APA)
In DepthDetails ArticlePubMed
TargetAminopeptidase N(Sus scrofa (Pig))
University Of Paris
Curated by ChEMBL
LigandPNGBDBM50036961(CHEMBL100575 | Sodium; (S)-3-amino-4-mercapto-buta...)
Affinity DataKi:  2.50E+4nM. Assay description: Inhibitory potency was measured on aminopeptidase N (APN)
In DepthDetails ArticlePubMed