BDBM50037355 2-(3-Methanesulfonylamino-2-oxo-6-phenyl-2H-pyridin-1-yl)-N-(3,3,3-trifluoro-1-isopropyl-2-oxo-propyl)-acetamide::CHEMBL111955
SMILES CC(C)C(NC(=O)Cn1c(ccc(NS(C)(=O)=O)c1=O)-c1ccccc1)C(=O)C(F)(F)F
InChI Key InChIKey=VPARDDNYEIUZKA-UHFFFAOYSA-N
Data  1 KI
  Tab Delimited (TSV)   2D SDfile   Computed 3D by Vconf -m prep SDfile
Find this compound or compounds like it in BindingDB:
Activity Spreadsheet -- Enzyme Inhibition Constant Data from BindingDB
Found 1 hit for monomerid = 50037355
TargetNeutrophil elastase(Homo sapiens (Human))
Zeneca Pharmaceuticals Group
Curated by ChEMBL
LigandPNGBDBM50037355(2-(3-Methanesulfonylamino-2-oxo-6-phenyl-2H-pyridi...)
Affinity DataKi:  9.30nM. Assay description: Binding affinity against human leukocyte elastase (HLE) enzyme
In DepthDetails ArticlePubMed