BDBM50037399 6-Amino-2-(3-amino-phenyl)-chromen-4-one::CHEMBL115103
SMILES Nc1cccc(c1)-c1cc(=O)c2cc(N)ccc2o1
InChI Key InChIKey=JHCRMYACOBDZEC-UHFFFAOYSA-N
Data  3 IC50
  Tab Delimited (TSV)   2D SDfile   Computed 3D by Vconf -m prep SDfile
Find this compound or compounds like it in BindingDB:
Activity Spreadsheet -- Enzyme Inhibition Constant Data from BindingDB
Found 3 hits for monomerid = 50037399
TargetProto-oncogene tyrosine-protein kinase Src(Homo sapiens (Human))
Purdue University
Curated by ChEMBL
LigandPNGBDBM50037399(6-Amino-2-(3-amino-phenyl)-chromen-4-one | CHEMBL1...)
Affinity DataIC50: >5.00E+4nM. Assay description: Inhibition of in vitro protein-tyrosine kinase activity of p60v-src enzyme in presence of 5 uM ATP.
In DepthDetails ArticlePubMed
TargetEpidermal growth factor receptor(Homo sapiens (Human))
Purdue University
Curated by ChEMBL
LigandPNGBDBM50037399(6-Amino-2-(3-amino-phenyl)-chromen-4-one | CHEMBL1...)
Affinity DataIC50: >1.00E+5nM. Assay description: Inhibition of in vitro activity of EGFr enzyme from A431 cells in presence of 5 uM ATP
In DepthDetails ArticlePubMed
TargetTyrosine-protein kinase Lck(Homo sapiens (Human))
Purdue University
Curated by ChEMBL
LigandPNGBDBM50037399(6-Amino-2-(3-amino-phenyl)-chromen-4-one | CHEMBL1...)
Affinity DataIC50:  2.00E+5nM. Assay description: In vitro inhibition of protein-tyrosine activity of p56lck enzyme in presence of 50 uM ATP
In DepthDetails ArticlePubMed