BDBM50037424 1,3-Dibutyl-3,7-dihydro-purine-2,6-dione::CHEMBL114770
SMILES CCCCn1c2nc[nH]c2c(=O)n(CCCC)c1=O
InChI Key InChIKey=HDAPVDGMACVEKL-UHFFFAOYSA-N
Data  3 KI
  Tab Delimited (TSV)   2D SDfile   Computed 3D by Vconf -m prep SDfile
Find this compound or compounds like it in BindingDB:
Activity Spreadsheet -- Enzyme Inhibition Constant Data from BindingDB
Found 3 hits for monomerid = 50037424
TargetAdenosine receptor A1(Rattus norvegicus (rat))
National Institute Of Diabetes
Curated by ChEMBL
LigandPNGBDBM50037424(1,3-Dibutyl-3,7-dihydro-purine-2,6-dione | CHEMBL1...)
Affinity DataKi:  500nM. Assay description: Displacement of [3H]-PIA from adenosine A1 receptors of rat brain membrane
In DepthDetails ArticlePubMed
TargetAdenosine receptor A2a(Rattus norvegicus (rat))
National Institute Of Diabetes
Curated by ChEMBL
LigandPNGBDBM50037424(1,3-Dibutyl-3,7-dihydro-purine-2,6-dione | CHEMBL1...)
Affinity DataKi:  2.93E+4nM. Assay description: Displacement of [3H]-CGS- 21680 from adenosine A2a receptors of rat striatal membrane
In DepthDetails ArticlePubMed
TargetAdenosine receptor A3(Rattus norvegicus)
National Institute Of Diabetes
Curated by ChEMBL
LigandPNGBDBM50037424(1,3-Dibutyl-3,7-dihydro-purine-2,6-dione | CHEMBL1...)
Affinity DataKi:  1.43E+5nM. Assay description: Displacement of [125I]-AB-MECA from membranes of CHO cells stably transfected with the rat adenosine A3 receptor cDNA
In DepthDetails ArticlePubMed