BDBM50037873 CBS-2::CHEMBL341130
SMILES OC(=O)C(Cc1c[nH]c2ccccc12)NC(=O)CCNC(=O)CCC(=O)N(Cc1ccccc1)N=NCCCl
InChI Key InChIKey=HLZQOPDTPDBEQY-UHFFFAOYSA-N
Data  1 EC50
  Tab Delimited (TSV)   2D SDfile   Computed 3D by Vconf -m prep SDfile
Find this compound or compounds like it in BindingDB:
Activity Spreadsheet -- Enzyme Inhibition Constant Data from BindingDB
Found 1 hit for monomerid = 50037873
TargetGastrin/cholecystokinin type B receptor(RAT)
National Cancer Institute-Frederick
Curated by ChEMBL
LigandPNGBDBM50037873(CBS-2 | CHEMBL341130)
Affinity DataEC50:  2.00E+5nM. Assay description: Tested for the 50% inhibition level against [125I]- gastrin binding in AR42J cells
In DepthDetails ArticlePubMed