BDBM50037944 1-[4,4-diethyl-2-(4-methylsulfonylphenyl)-1-cyclopentenyl]-4-fluorobenzene::CHEMBL129215
SMILES CCC1(CC)CC(=C(C1)c1ccc(cc1)S(C)(=O)=O)c1ccc(F)cc1
InChI Key InChIKey=WVOYZEONSBZBRS-UHFFFAOYSA-N
Data  2 IC50
  Tab Delimited (TSV)   2D SDfile   Computed 3D by Vconf -m prep SDfile
Find this compound or compounds like it in BindingDB:
Activity Spreadsheet -- Enzyme Inhibition Constant Data from BindingDB
Found 2 hits for monomerid = 50037944
TargetProstaglandin G/H synthase 2(Homo sapiens (Human))
Searle Research & Development
Curated by ChEMBL
LigandPNGBDBM50037944(1-[4,4-diethyl-2-(4-methylsulfonylphenyl)-1-cyclop...)
Affinity DataIC50:  6.50E+4nM. Assay description: Tested for inhibition against Prostaglandin G/H synthase 2
In DepthDetails ArticlePubMed
TargetProstaglandin G/H synthase 1(Homo sapiens (Human))
Searle Research & Development
Curated by ChEMBL
LigandPNGBDBM50037944(1-[4,4-diethyl-2-(4-methylsulfonylphenyl)-1-cyclop...)
Affinity DataIC50: >1.00E+5nM. Assay description: Tested for inhibition against Prostaglandin G/H synthase 1
In DepthDetails ArticlePubMed