BDBM50038113 (6R,7R)-1-((4S,5R)-4-Acetoxy-5-methyl-3-methylene-6-phenyl-hexyl)-6-cyclopropylmethylcarbamoyloxy-4,7-dihydroxy-2,8-dioxa-bicyclo[3.2.1]octane-3,4,5-tricarboxylic acid::CHEMBL407141
SMILES C[C@H](Cc1ccccc1)[C@H](OC(C)=O)C(=C)CCC12OC([C@H](OC(=O)NCC3CC3)[C@H]1O)(C(O)=O)C(O)(C(O2)C(O)=O)C(O)=O
InChI Key InChIKey=RFMWXENELMWESH-YUPKCFJISA-N
Data  1 IC50
  Tab Delimited (TSV)   2D SDfile   Computed 3D by Vconf -m prep SDfile
Find this compound or compounds like it in BindingDB:
Activity Spreadsheet -- Enzyme Inhibition Constant Data from BindingDB
Found 1 hit for monomerid = 50038113
TargetSqualene synthase(Rattus norvegicus)
Merck Research Laboratories
Curated by ChEMBL
LigandPNGBDBM50038113((6R,7R)-1-((4S,5R)-4-Acetoxy-5-methyl-3-methylene-...)
Affinity DataIC50:  17nM. Assay description: Tested for inhibition against squalene synthase enzyme in rat liver
In DepthDetails ArticlePubMed