BDBM50038191 4'-(2-Ethyl-5,7-dimethyl-imidazo[4,5-b]pyridin-3-ylmethyl)-biphenyl-2-sulfonic acid acetyl-amide::CHEMBL334670
SMILES CCc1nc2c(C)cc(C)nc2n1Cc1ccc(cc1)-c1ccccc1S(=O)(=O)NC(C)=O
InChI Key InChIKey=FNVVJLKPCLOYIY-UHFFFAOYSA-N
Data  2 IC50
  Tab Delimited (TSV)   2D SDfile   Computed 3D by Vconf -m prep SDfile
Find this compound or compounds like it in BindingDB:
Activity Spreadsheet -- Enzyme Inhibition Constant Data from BindingDB
Found 2 hits for monomerid = 50038191
TargetType-2 angiotensin II receptor(RAT)
Merck Research Laboratories
Curated by ChEMBL
LigandPNGBDBM50038191(4'-(2-Ethyl-5,7-dimethyl-imidazo[4,5-b]pyridin-3-y...)
Affinity DataIC50: >1.00E+4nM. Assay description: In vitro binding affinity of the compound for angiotensin II AT2 receptor in rat midbrain
In DepthDetails ArticlePubMed
TargetType-1 angiotensin II receptor(RABBIT)
Merck Research Laboratories
Curated by ChEMBL
LigandPNGBDBM50038191(4'-(2-Ethyl-5,7-dimethyl-imidazo[4,5-b]pyridin-3-y...)
Affinity DataIC50:  2.20nM. Assay description: In vitro binding affinity of the compound for angiotensin II AT1 receptor in rabbit aorta
In DepthDetails ArticlePubMed