BDBM50038234 5-(2-Methyl-2H-[1,2,3]triazol-4-yl)-1,2,3,6-tetrahydro-pyridine::CHEMBL133961
SMILES Cn1ncc(n1)C1=CCCNC1
InChI Key InChIKey=OFARYLOPCBTRKQ-UHFFFAOYSA-N
Data  1 KI
  Tab Delimited (TSV)   2D SDfile   Computed 3D by Vconf -m prep SDfile
Find this compound or compounds like it in BindingDB:
Activity Spreadsheet -- Enzyme Inhibition Constant Data from BindingDB
Found 1 hit for monomerid = 50038234
TargetMuscarinic acetylcholine receptor M1(RAT)
H. Lundbeck
Curated by ChEMBL
LigandPNGBDBM50038234(5-(2-Methyl-2H-[1,2,3]triazol-4-yl)-1,2,3,6-tetrah...)
Affinity DataKi:  500nM. Assay description: In vitro binding affinity for muscarinic M1 receptor by displacing [3H]-Pirenzepine binding on rat brain homogenate.
In DepthDetails ArticlePubMed