BDBM50038241 5-(2-Hexyl-2H-tetrazol-5-yl)-1-methyl-1,2,3,6-tetrahydro-pyridine::CHEMBL278422
SMILES CCCCCCn1nnc(n1)C1=CCCN(C)C1
InChI Key InChIKey=LOBCZTWDDNPUTO-UHFFFAOYSA-N
Data  1 KI
  Tab Delimited (TSV)   2D SDfile   Computed 3D by Vconf -m prep SDfile
Find this compound or compounds like it in BindingDB:
Activity Spreadsheet -- Enzyme Inhibition Constant Data from BindingDB
Found 1 hit for monomerid = 50038241
TargetMuscarinic acetylcholine receptor M1(RAT)
H. Lundbeck
Curated by ChEMBL
LigandPNGBDBM50038241(5-(2-Hexyl-2H-tetrazol-5-yl)-1-methyl-1,2,3,6-tetr...)
Affinity DataKi:  32nM. Assay description: In vitro binding affinity for muscarinic M1 receptor by displacing [3H]-Pirenzepine binding on rat brain homogenate.
In DepthDetails ArticlePubMed