BDBM50038358 CHEMBL3360572
SMILES C(CN1Cc2ccccc2C1)CN1CCc2oc3ccccc3c2C1
InChI Key InChIKey=NAHFFBVGHJZTNG-UHFFFAOYSA-N
Data  1 KI
  Tab Delimited (TSV)   2D SDfile   Computed 3D by Vconf -m prep SDfile
Find this compound or compounds like it in BindingDB:
Activity Spreadsheet -- Enzyme Inhibition Constant Data from BindingDB
Found 1 hit for monomerid = 50038358
TargetSigma non-opioid intracellular receptor 1(Homo sapiens (Human))
University Of Lille
Curated by ChEMBL
LigandPNGBDBM50038358(CHEMBL3360572)
Affinity DataKi:  11nM. Assay description: Displacement of [3H](+)-pentazocine from human sigma 1 receptor in human Jurkat cell membranes incubated for 2 hrs by liquid scintillation counting
In DepthDetails ArticlePubMed