BDBM50038648 CHEMBL301264::[2-(4-Fluoro-phenyl)-6,6-dimethyl-1-phenyl-6,7-dihydro-5H-pyrrolizin-3-yl]-acetic acid
SMILES CC1(C)Cc2c(c(c(CC(O)=O)n2C1)-c1ccc(F)cc1)-c1ccccc1
InChI Key InChIKey=TUUOQYCXIVGFBS-UHFFFAOYSA-N
Data  1 IC50
  Tab Delimited (TSV)   2D SDfile   Computed 3D by Vconf -m prep SDfile
Find this compound or compounds like it in BindingDB:
Activity Spreadsheet -- Enzyme Inhibition Constant Data from BindingDB
Found 1 hit for monomerid = 50038648
Target5-lipoxygenase(Bos taurus)
Merckle
Curated by ChEMBL
LigandPNGBDBM50038648(CHEMBL301264 | [2-(4-Fluoro-phenyl)-6,6-dimethyl-1...)
Affinity DataIC50: >1.00E+4nM. Assay description: Inhibition of 5-lipoxygenase in bovine PMNL cell assay.
In DepthDetails ArticlePubMed