BDBM50038651 CHEMBL300670::[2-(4-Acetylamino-phenyl)-6,6-dimethyl-1-phenyl-6,7-dihydro-5H-pyrrolizin-3-yl]-acetic acid
SMILES CC(=O)Nc1ccc(cc1)-c1c(CC(O)=O)n2CC(C)(C)Cc2c1-c1ccccc1
InChI Key InChIKey=PUOHEPQFAYKACX-UHFFFAOYSA-N
Data  1 IC50
  Tab Delimited (TSV)   2D SDfile   Computed 3D by Vconf -m prep SDfile
Find this compound or compounds like it in BindingDB:
Activity Spreadsheet -- Enzyme Inhibition Constant Data from BindingDB
Found 1 hit for monomerid = 50038651
Target5-lipoxygenase(Bos taurus)
Merckle
Curated by ChEMBL
LigandPNGBDBM50038651(CHEMBL300670 | [2-(4-Acetylamino-phenyl)-6,6-dimet...)
Affinity DataIC50:  1.00E+4nM. Assay description: Inhibition of 5-lipoxygenase in bovine PMNL cell assay.
In DepthDetails ArticlePubMed