BDBM50038653 2-(2,2-dimethyl-6-(4-nitrophenyl)-7-phenyl-2,3-dihydro-1H-pyrrolizin-5-yl)acetic acid::CHEMBL292239::[6,6-Dimethyl-2-(4-nitro-phenyl)-1-phenyl-6,7-dihydro-5H-pyrrolizin-3-yl]-acetic acid
SMILES CC1(C)Cc2c(c(c(CC(O)=O)n2C1)-c1ccc(cc1)[N+]([O-])=O)-c1ccccc1
InChI Key InChIKey=VYMSMZLVFCEANQ-UHFFFAOYSA-N
Data  1 IC50
  Tab Delimited (TSV)   2D SDfile   Computed 3D by Vconf -m prep SDfile
Find this compound or compounds like it in BindingDB:
Activity Spreadsheet -- Enzyme Inhibition Constant Data from BindingDB
Found 1 hit for monomerid = 50038653
Target5-lipoxygenase(Bos taurus)
Merckle
Curated by ChEMBL
LigandPNGBDBM50038653(2-(2,2-dimethyl-6-(4-nitrophenyl)-7-phenyl-2,3-dih...)
Affinity DataIC50:  1.50E+3nM. Assay description: Inhibition of 5-lipoxygenase in bovine PMNL cell assay.
In DepthDetails ArticlePubMed