BDBM50038845 2-(4-bromo-2-fluorobenzyl)-5-fluoro-6-methoxy-1H,2'H,5'H-spiro[isoquinoline-4,3'-pyrrolidine]-1,2',3,5'(2H)-tetrone::CHEMBL293170
SMILES COc1ccc2C(=O)N(Cc3ccc(Br)cc3F)C(=O)C3(CC(=O)NC3=O)c2c1F
InChI Key InChIKey=LZBHFGUSTFFZFW-UHFFFAOYSA-N
Data  1 IC50
  Tab Delimited (TSV)   2D SDfile   Computed 3D by Vconf -m prep SDfile
Find this compound or compounds like it in BindingDB:
Activity Spreadsheet -- Enzyme Inhibition Constant Data from BindingDB
Found 1 hit for monomerid = 50038845
TargetAldo-keto reductase family 1 member B1 [K65Q](Bos taurus (Cattle))
Wyeth-Ayerst Research
Curated by ChEMBL
LigandPNGBDBM50038845(2-(4-bromo-2-fluorobenzyl)-5-fluoro-6-methoxy-1H,2...)
Affinity DataIC50:  30nM. Assay description: In vitro inhibition of aldose reductase activity in a partially purified bovine lens preparationChecked by Author
In DepthDetails ArticlePubMed