BDBM50038902 1-[6-Chloro-4-(4-chloro-phenyl)-quinolin-3-yl]-3-(2,4-difluoro-phenyl)-urea::CHEMBL62463
SMILES Fc1ccc(NC(=O)Nc2cnc3ccc(Cl)cc3c2-c2ccc(Cl)cc2)c(F)c1
InChI Key InChIKey=SZIGAGNHDUNQOQ-UHFFFAOYSA-N
Data  1 IC50
  Tab Delimited (TSV)   2D SDfile   Computed 3D by Vconf -m prep SDfile
Find this compound or compounds like it in BindingDB:
Activity Spreadsheet -- Enzyme Inhibition Constant Data from BindingDB
Found 1 hit for monomerid = 50038902
TargetSterol O-acyltransferase 1(Rattus norvegicus)
Takeda Chemical Industries
Curated by ChEMBL
LigandPNGBDBM50038902(1-[6-Chloro-4-(4-chloro-phenyl)-quinolin-3-yl]-3-(...)
Affinity DataIC50:  534nM. Assay description: Inhibitory activity against acyl coenzyme A:cholesterol acyltransferase in rat microsomes
In DepthDetails ArticlePubMed