BDBM50039121 (S)-2-{4-[(2-Amino-5-formyl-4-oxo-1,4,5,6,7,8-hexahydro-pteridin-6-ylmethyl)-amino]-benzoylamino}-pentanedioic acid::2-{4-[(2-Amino-5-formyl-4-oxo-1,4,5,6,7,8-hexahydro-pteridin-6-ylmethyl)-amino]-benzoylamino}-pentanedioic acid::CHEMBL69905
SMILES Nc1nc2NCC(CNc3ccc(cc3)C(=O)N[C@@H](CCC(O)=O)C(O)=O)N(C=O)c2c(=O)[nH]1
InChI Key InChIKey=VVIAGPKUTFNRDU-UHFFFAOYSA-N
Data  1 KI
  Tab Delimited (TSV)   2D SDfile   Computed 3D by Vconf -m prep SDfile
Find this compound or compounds like it in BindingDB:
Activity Spreadsheet -- Enzyme Inhibition Constant Data from BindingDB
Found 1 hit for monomerid = 50039121
TargetDihydrofolate reductase(Homo sapiens (Human))
Harvard Medical School
Curated by ChEMBL
LigandPNGBDBM50039121((S)-2-{4-[(2-Amino-5-formyl-4-oxo-1,4,5,6,7,8-hexa...)
Affinity DataKi:  2.37E+3nM. Assay description: Tested for the inhibition of [14C]-DDATHF influx in CCRF-CEM cells of human leukemic lymphoblast
In DepthDetails ArticlePubMed